{"text_format":"1","workbook":"xlsx","n_sheets":4,"sheets":["Linea","formato para imprimir","Conceptos","Ejemplos"],"not_rendered":{"charts":0,"images":7,"macros":1,"external_links":0,"defined_names":2,"comments":0,"pivot_tables":0},"unopened":[],"bounds":{"document_bytes":16777216,"sheet_cells":100000,"rows_first":2000,"rows_last":500,"rows_between":2000,"halvings":0,"cell_chars":16384,"cell_head_chars":4096},"cells_cut":0,"cells_raw":0,"read":"whole","date_system":"1900"}

{"sheet":"Linea","index":0,"n_rows":28,"n_cols":3,"rows_kept":28,"cut":false,"hidden":false,"merged":[[19,0,19,1]]}
[]
[]
[]
[]
[]
[]
[]
[]
[]
[]
[]
[]
[]
[]
[]
[]
[]
[]
[]
["LINEA DE CAPTURA"]
["N_control"]
["Concepto",null,{"$f":"IFERROR(VLOOKUP(B22,Conceptos!B3:D56,3,FALSE),\"\")","v":""}]
["Monto",{"$f":"IFERROR(VLOOKUP(C22,Conceptos!$A$3:$C$1048576,3,FALSE),\"\")","v":""}]
["Apellido Paterno"]
["Apelido Materno"]
["Nombre(s)"]
["Semestre/Nivel"]
["Carrera",null,{"$f":"IFERROR(VLOOKUP(B28,Conceptos!F10:G16,2,FALSE),\" \")","v":" "}]

{"sheet":"formato para imprimir","index":1,"n_rows":1414,"n_cols":48,"rows_kept":1414,"cut":false,"hidden":false,"merged":[[2,2,3,44],[11,5,11,45],[13,35,13,38],[13,5,13,33],[9,1,9,9],[9,39,9,47],[5,1,6,5],[13,39,13,47],[9,32,9,38],[11,1,11,4],[13,1,13,4],[9,10,9,16],[25,13,25,32],[19,7,21,35],[17,9,17,20],[17,1,17,8],[15,1,15,4],[15,5,15,32]]}
[]
[]
[null,null,"INSTITUTO TECNOLÓGICO DE GUSTAVO A. MADERO II"]
[]
[]
[null,"Linea de Captura"]
[]
[null,"B:",{"$f":"IF(Linea!C20=\"\",\"\",Linea!C20)","v":""},{"$f":"IF(Linea!D20=\"\",\"\",Linea!D20)","v":""},{"$f":"IF(Linea!E20=\"\",\"\",Linea!E20)","v":""},{"$f":"IF(Linea!F20=\"\",\"\",Linea!F20)","v":""},{"$f":"IF(Linea!G20=\"\",\"\",Linea!G20)","v":""},{"$f":"IF(Linea!H20=\"\",\"\",Linea!H20)","v":""},{"$f":"IF(Linea!I20=\"\",\"\",Linea!I20)","v":""},{"$f":"IF(Linea!J20=\"\",\"\",Linea!J20)","v":""},{"$f":"IF(Linea!K20=\"\",\"\",Linea!K20)","v":""},{"$f":"IF(Linea!L20=\"\",\"\",Linea!L20)","v":""},{"$f":"IF(Linea!M20=\"\",\"\",Linea!M20)","v":""},{"$f":"IF(Linea!N20=\"\",\"\",Linea!N20)","v":""},{"$f":"IF(Linea!O20=\"\",\"\",Linea!O20)","v":""},{"$f":"IF(Linea!P20=\"\",\"\",Linea!P20)","v":""},{"$f":"IF(Linea!Q20=\"\",\"\",Linea!Q20)","v":""},{"$f":"IF(Linea!R20=\"\",\"\",Linea!R20)","v":""},{"$f":"IF(Linea!S20=\"\",\"\",Linea!S20)","v":""},{"$f":"IF(Linea!T20=\"\",\"\",Linea!T20)","v":""},{"$f":"IF(Linea!U20=\"\",\"\",Linea!U20)","v":""},{"$f":"IF(Linea!V20=\"\",\"\",Linea!V20)","v":""},{"$f":"IF(Linea!W20=\"\",\"\",Linea!W20)","v":""},{"$f":"IF(Linea!X20=\"\",\"\",Linea!X20)","v":""},{"$f":"IF(Linea!Y20=\"\",\"\",Linea!Y20)","v":""},{"$f":"IF(Linea!Z20=\"\",\"\",Linea!Z20)","v":""},{"$f":"IF(Linea!AA20=\"\",\"\",Linea!AA20)","v":""},{"$f":"IF(Linea!AB20=\"\",\"\",Linea!AB20)","v":""},{"$f":"IF(Linea!AC20=\"\",\"\",Linea!AC20)","v":""},{"$f":"IF(Linea!AD20=\"\",\"\",Linea!AD20)","v":""},{"$f":"IF(Linea!AE20=\"\",\"\",Linea!AE20)","v":""},{"$f":"IF(Linea!AF20=\"\",\"\",Linea!AF20)","v":""},{"$f":"IF(Linea!AG20=\"\",\"\",Linea!AG20)","v":""},{"$f":"IF(Linea!AH20=\"\",\"\",Linea!AH20)","v":""},{"$f":"IF(Linea!AI20=\"\",\"\",Linea!AI20)","v":""},{"$f":"IF(Linea!AJ20=\"\",\"\",Linea!AJ20)","v":""},{"$f":"IF(Linea!AK20=\"\",\"\",Linea!AK20)","v":""},{"$f":"IF(Linea!AL20=\"\",\"\",Linea!AL20)","v":""},{"$f":"IF(Linea!AM20=\"\",\"\",Linea!AM20)","v":""},{"$f":"IF(Linea!AN20=\"\",\"\",Linea!AN20)","v":""},{"$f":"IF(Linea!AO20=\"\",\"\",Linea!AO20)","v":""},{"$f":"IF(Linea!AP20=\"\",\"\",Linea!AP20)","v":""},{"$f":"IF(Linea!AQ20=\"\",\"\",Linea!AQ20)","v":""},{"$f":"IF(Linea!AR20=\"\",\"\",Linea!AR20)","v":""},{"$f":"IF(Linea!AS20=\"\",\"\",Linea!AS20)","v":""},{"$f":"IF(Linea!AT20=\"\",\"\",Linea!AT20)","v":""},{"$f":"IF(Linea!AU20=\"\",\"\",Linea!AU20)","v":""},{"$f":"IF(Linea!AV20=\"\",\"\",Linea!AV20)","v":""}]
[]
[null,"Nùmero de Control:",null,null,null,null,null,null,null,null,{"$f":"UPPER(Linea!$B$21)","v":""},null,null,null,null,null,null,null,null,null,null,null,null,null,null,null,null,null,null,null,null,null,"Semestre",null,null,null,null,null,null,{"$f":"IF(Linea!B27=\"\",\"\",Linea!B27)","v":""}]
[]
[null,"Nombre completo:",null,null,null,{"$f":"UPPER(CONCATENATE(Linea!$B$26,\" \",Linea!$B$24,\" \",Linea!$B$25))","v":"  "}]
[]
[null,"Concepto:",null,null,null,{"$f":"UPPER(Linea!$B$22)","v":""},null,null,null,null,null,null,null,null,null,null,null,null,null,null,null,null,null,null,null,null,null,null,null,null,null,null,null,null,null,"Monto:",null,null,null,{"$f":"IF(Linea!C24=\"\",\"\",Linea!C24)","v":""}]
[]
[null,"Carrera:",null,null,null,{"$f":"UPPER(Linea!$B$28)","v":""}]
[]
[null,"Fecha limite de pago:",null,null,null,null,null,null,null,{"$f":"IF(Linea!C25=\"\",\"\",Linea!C25)","v":""}]
[]
[null,null,null,null,null,null,null,{"$f":"IF(OR(Conceptos!$B$48=Linea!$B$22,Conceptos!$B$49=Linea!$B$22),CONCATENATE(\"PERIODO \",IF(AND(MONTH(NOW())>=1,MONTH(NOW())<=6),\"AGOSTO - DICIEMBRE\",\"ENERO - JUNIO\"),\" \",IF(AND(MONTH(NOW())>1,MONTH(NOW())<=6),YEAR(NOW()),YEAR(NOW())+1)),CONCATENATE(\"PERIODO \",IF(AND(MONTH(NOW())>=1,MONTH(NOW())<=6),\"ENERO - JUNIO\",\"AGOSTO - DICIEMBRE\"),\" \",YEAR(NOW())))","v":"PERIODO AGOSTO - DICIEMBRE 2024"}]
[]
[]
[]
[]
[]
[]
[]
[]
[]
[]
[]
[]
[]
[]
[]
[]
[]
[]
[]
[]
[]
[]
[]
[]
[]
[]
[]
[]
[]
[]
[]
[]
[]
[]
[]
[]
[]
[]
[]
[]
[]
[]
[]
[]
[]
[]
[]
[]
[]
[]
[]
[]
[]
[]
[]
[]
[]
[]
[]
[]
[]
[]
[]
[]
[]
[]
[]
[]
[]
[]
[]
[]
[]
[]
[]
[]
[]
[]
[]
[]
[]
[]
[]
[]
[]
[]
[]
[]
[]
[]
[]
[]
[]
[]
[]
[]
[]
[]
[]
[]
[]
[]
[]
[]
[]
[]
[]
[]
[]
[]
[]
[]
[]
[]
[]
[]
[]
[]
[]
[]
[]
[]
[]
[]
[]
[]
[]
[]
[]
[]
[]
[]
[]
[]
[]
[]
[]
[]
[]
[]
[]
[]
[]
[]
[]
[]
[]
[]
[]
[]
[]
[]
[]
[]
[]
[]
[]
[]
[]
[]
[]
[]
[]
[]
[]
[]
[]
[]
[]
[]
[]
[]
[]
[]
[]
[]
[]
[]
[]
[]
[]
[]
[]
[]
[]
[]
[]
[]
[]
[]
[]
[]
[]
[]
[]
[]
[]
[]
[]
[]
[]
[]
[]
[]
[]
[]
[]
[]
[]
[]
[]
[]
[]
[]
[]
[]
[]
[]
[]
[]
[]
[]
[]
[]
[]
[]
[]
[]
[]
[]
[]
[]
[]
[]
[]
[]
[]
[]
[]
[]
[]
[]
[]
[]
[]
[]
[]
[]
[]
[]
[]
[]
[]
[]
[]
[]
[]
[]
[]
[]
[]
[]
[]
[]
[]
[]
[]
[]
[]
[]
[]
[]
[]
[]
[]
[]
[]
[]
[]
[]
[]
[]
[]
[]
[]
[]
[]
[]
[]
[]
[]
[]
[]
[]
[]
[]
[]
[]
[]
[]
[]
[]
[]
[]
[]
[]
[]
[]
[]
[]
[]
[]
[]
[]
[]
[]
[]
[]
[]
[]
[]
[]
[]
[]
[]
[]
[]
[]
[]
[]
[]
[]
[]
[]
[]
[]
[]
[]
[]
[]
[]
[]
[]
[]
[]
[]
[]
[]
[]
[]
[]
[]
[]
[]
[]
[]
[]
[]
[]
[]
[]
[]
[]
[]
[]
[]
[]
[]
[]
[]
[]
[]
[]
[]
[]
[]
[]
[]
[]
[]
{"$rows_left_out":1015}
{"sheet":"Conceptos","index":2,"n_rows":49,"n_cols":10,"rows_kept":49,"cut":false,"hidden":false,"merged":[]}
[]
["CLAVE","CONCEPTO","MONTO","Departamento","00","General (Todos)",null,null,null,"SEMESTRE"]
["0000000000000","Otros",1,{"$f":"A3","v":"0000000000000"},null,null,null,{"$f":"LEN(A3)","v":13},null,"00"]
["0000000000001","Re-expedición de documento oficial",55,"0000000000001","01","Servicios Escolares",null,{"$f":"LEN(A4)","v":13},null,"01"]
["0000000000101","Certificado Parcial o Total",1990,"0000000000101","02","División de Estudios Profesionales",null,13,null,"02"]
["0000000000102","Diploma por salida lateral",1980,"0000000000102","03","Biblioteca",null,13,null,"03"]
["0000000000103","Constancia de avance",33,"0000000000103","04","Vinculación",null,13,null,"04"]
["0000000000104","Constancia de liberación de 5 créditos",33,"0000000000104","05","Desarrollo Académico",null,13,null,"05"]
["0000000000105","Kardex",33,"0000000000105","06","Planeación y Vinculación",null,13,null,"06"]
["0000000000106","Constancia de Estudios",33,"0000000000106",null,"ADMINISTRACION","01",13,null,"07"]
["0000000000107","Constancia de Seguro Social",33,"0000000000107",null,"ARQUITECTURA","03",13,null,"08"]
["0000000000108","Constancia Trámite de Título",110,"0000000000108",null,"INDUSTRIAL","02",13,null,"09"]
["0000000000109","Carta de Terminación de Estudios",110,"0000000000109",null,"INGLES INTERNO","04",13,null,"10"]
["0000000000110","Duplicado de Credencial",165,"0000000000110",null,"INGLES EXTERNO","05",13,null,"11"]
["0000000000111","Titulación",3300,"0000000000111",null,"ADMINISTRATIVO","06",13,null,"12"]
["0000000000112","Re-expedición de Titulo Profesional",1100,{"$f":"A16","v":"0000000000112"},null,"TIC´S","07",13,null,"Más de 12 semestres"]
["0000000000113","Re-expedición de Certificado",1100,"0000000000113",null,null,null,13,null,"Administativo"]
["0000000000114","Seminario de Titulación",7700,"0000000000114",null,null,null,13]
["0000000000115","Acto Protocolario Externo",1500,{"$f":"A19","v":"0000000000115"},null,null,null,13]
["0000000000201","Carta de Translados",1980,"0000000000201",null,null,null,13]
["0000000000203","Programa de Estudios por materia, impreso y Sellado",110,"0000000000203",null,null,null,13]
["0000000000204","Programas de Estudios digital y oficio de Resolución",1100,"0000000000204",null,null,null,13]
["0000000000205","Retícula Sellada",55,"0000000000205",null,null,null,{"$f":"LEN(A21)","v":13}]
["0000000000206","Análisis Académico de Resolución de equivalencia de Estudios (por materia)",198,"0000000000206",null,null,null,13]
["0000000000207","Pago de derechos, resolución de equivalencia a la SEP",1100,"0000000000207",null,null,null,13]
["0000000000208","Dictámen técnico de Resolución de Equivalencia",110,"0000000000208",null,null,null,13]
["0000000000209","Curso de Verano de 48 hrs / 6 semanas / 1.5 hrs diarias",500,"0000000000209",null,null,null,13]
["0000000000210","Curso de Verano de 64 hrs / 6 semanas / 2 hrs diarias",650,"0000000000210",null,null,null,13]
["0000000000211","Curso de Verano de 80 hrs / 6 semanas / 2.5 hrs diarias",800,"0000000000211",null,null,null,13]
["0000000000220","Curso de Verano de 112 hrs / 6 semanas / 4 hrs diarias",1050,{"$f":"A30","v":"0000000000220"},null,null,null,13]
["0000000000212","Curso de Verano de 96 hrs / 6 semanas / 3 hrs diarias",950,"0000000000212",null,null,null,13]
["0000000000213","Curso de Verano de 128 hrs / 6 semanas / 4.5 hrs diarias",1100,"0000000000213",null,null,null,13]
["0000000000214","Reinscripción 5to Semestre o Posteriores",2500,"0000000000214",null,null,null,13]
["0000000000215","Reinscripción 2do. 3ro y 4to semestre",2800,"0000000000215",null,null,null,13]
["0000000000301","Aportación Bibliotecaria por día de atraso",11,{"$f":"A35","v":"0000000000301"},null,null,null,13]
["0000000000302","Donación de libros para titulación",1100,"0000000000302",null,null,null,13]
["0000000000401","Examen de liberación del Programa de Ingles",1000,"0000000000401",null,null,null,13]
["0000000000402","Curso de Regular Ingles para Personas Externas",1000,"0000000000402",null,null,null,{"$f":"LEN(A35)","v":13}]
["0000000000403","Curso de Regular Ingles para personal Interno",510,"0000000000403",null,null,null,13]
["0000000000404","Examen colocación Ingles",250,"0000000000404",null,null,null,13]
["0000000000405","Curso Regular de Ingles Alumnos de 1ro y 4to Semestre",750,"0000000000405",null,null,null,13]
["0000000000406","Curso Regular de Ingles Alumnos Semestre 5 A 12",510,"0000000000406",null,null,null,13]
["0000000000407","Curso Ingles Intersemestral para Personas Externas",1250,"0000000000407",null,null,null,13]
["0000000000408","Curso Ingles Intersemestral para Alumnos de 1ro y 4to Semestre",1010,"0000000000408",null,null,null,13]
["0000000000409","Curso Ingles Intersemestral Alumnos Semestres 5to a 12vo",750,"0000000000409",null,null,null,13]
["0000000000410","Curso Remedial Ingles",1700,"0000000000410",null,null,null,13]
["0000000000411","Constancia de Liberación de Ingles",50,"0000000000411",null,null,null,13]
["0000000000501","Nuevo Ingreso",2800,"0000000000501",null,null,null,13]
["0000000000502","Evaluación Diagnostica y curso de Habilidades Matematicas y Verbales",800,"0000000000502",null,null,null,13]

{"sheet":"Ejemplos","index":3,"n_rows":0,"n_cols":0,"rows_kept":0,"cut":false,"hidden":false,"merged":[]}